Скрыть объявление
На нашем форуме недоступен просмотр изображений для неавторизованных пользователей. Если Вы уже зарегистрированы на нашем форуме, то можете войти. Если у Вас еще нет аккаунта, мы будем рады, если Вы к нам присоединитесь. Зарегистрироваться Вы можете здесь.

Как компилить прошивки

Тема в разделе "Общие вопросы по esp8266", создана пользователем artmasterpro, 13 май 2016.

  1. artmasterpro

    artmasterpro Новичок

    Сообщения:
    48
    Симпатии:
    0
    Привет, подскажите пожалуйста.
    С NodeMcu разобрался все окей.

    Не могу понять как скомпилить и запустить проект, например вот этот GitHub - pvvx/mp3_decode: Test ESP8266 MP3 webradio (512k Flash)

    Можете направить куда почитать? для тупых?

    Спасибо!
     
  2. NutsXXXL

    NutsXXXL Читатель

    Сообщения:
    155
    Симпатии:
    17
    @artmasterpro Примерно так:
    1) ставиться UDK согласно рекомендациям, включая Eclipse
    2) запускаться этот самый Eclipse и в нем открывается файл проекта из этого репозитория
    3) компилируется и прошивается из Eclipse
     
  3. artmasterpro

    artmasterpro Новичок

    Сообщения:
    48
    Симпатии:
    0
    а можно ссылочку на авторитетную статью по установке ?
    спасибо!
     
  4. Victor

    Victor Administrator Команда форума

    Сообщения:
    2.209
    Симпатии:
    386
  5. artmasterpro

    artmasterpro Новичок

    Сообщения:
    48
    Симпатии:
    0
    Установил среду по инструкции, все окей.
    Подкинул проект GitHub - pvvx/mp3_decode: Test ESP8266 MP3 webradio (512k Flash)
    При билде выдает ошибки:

    Код (Text):
    1. Description   Resource   Path   Location   Type
    2. mingw32-make.exe: *** [.subdirs] Error 2   mp3_decode         C/C++ Problem
    3. mingw32-make[1]: *** [.output/eagle/bin/eagle.app.v6.bin] Error 2   mp3_decode         C/C++ Problem
    4. recipe for target '.output/eagle/bin/eagle.app.v6.bin' failed   Makefile   /mp3_decode   line 116   C/C++ Problem
    5. recipe for target '.subdirs' failed   Makefile   /mp3_decode   line 142   C/C++ Problem
    6.  
    7. ------------------------------------------------------------------------------
    8. ../Makefile:116: recipe for target '.output/eagle/bin/eagle.app.v6.bin' failed
    9. mingw32-make[1]: Leaving directory 'C:/Espressif/examples/mp3_decode-master/app'
    10. process_begin: CreateProcess(NULL, C:/Python27/python.exe C:\Espressif\examples\mp3_decode-master\esptool.py elf2image -es user_start_trampoline -o ../bin/ .output/eagle/image/eagle.app.v6.out, ...) failed.
    11. make (e=2): Не удается найти указанный файл.
    12.  
    13. mingw32-make[1]: *** [.output/eagle/bin/eagle.app.v6.bin] Error 2
    14. C:/Espressif/examples/mp3_decode-master/Makefile:142: recipe for target '.subdirs' failed
    15. mingw32-make.exe: *** [.subdirs] Error 2
    16.  
    Помогите пожалуйста понять....
     
  6. NutsXXXL

    NutsXXXL Читатель

    Сообщения:
    155
    Симпатии:
    17
    @artmasterpro pyton поставить надо так как запускается esptool.py и готовит бинарник
    Python Release Python 2.7.11
    либо esptool.exe заюзать
    ну собтвенно бинарник то должен уже и откомпилированный быть главное прошить ведь
     
  7. artmasterpro

    artmasterpro Новичок

    Сообщения:
    48
    Симпатии:
    0
    Питон поставил, 1 ошибка осталась, и bin файла в соответствующей папке нет

    Код (Text):
    1. ------------------------------------------------------------------------------
    2. Traceback (most recent call last):
    3.   File "C:\Espressif\examples\mp3_decode-master\esptool.py", line 22, in <module>
    4.     import serial
    5. ImportError: No module named serial
    6. mingw32-make[1]: *** [.output/eagle/bin/eagle.app.v6.bin] Error 1
    7. ../Makefile:116: recipe for target '.output/eagle/bin/eagle.app.v6.bin' failed
    8. mingw32-make[1]: Leaving directory 'C:/Espressif/examples/mp3_decode-master/app'
    9. C:/Espressif/examples/mp3_decode-master/Makefile:142: recipe for target '.subdirs' failed
    10. mingw32-make.exe: *** [.subdirs] Error 2
     
  8. NutsXXXL

    NutsXXXL Читатель

    Сообщения:
    155
    Симпатии:
    17
  9. artmasterpro

    artmasterpro Новичок

    Сообщения:
    48
    Симпатии:
    0
  10. kokuam

    kokuam Новичок

    Сообщения:
    4
    Симпатии:
    0
    Может кому пригодится : при установке Pyton 2.7 вылетает такая ошибка если выбрать "Установить для всех пользователей", помогает опция "Только для меня"

    An error occurred during the installation of assembly 'Microsoft.VC90.CRT, version="9.0.30729.1", publicKeyTocken="1fc8b3b9a1e18e3b", processorArchitecture="amd64", type="win32"'. Please refer to Help and Support for more information.
     

Поделиться этой страницей